[Date Prev][Date Next][Thread Prev][Thread Next][Date Index][Thread Index]

RE: CloudStack master and 4.11.2 RC5 build issues

Wido, are you planning on building and testing RC5 today?  I'll hold off on a result with my vote if you are.

Kind regards,

Paul Angus

Amadeus House, Floral Street, London  WC2E 9DPUK

-----Original Message-----
From: Rohit Yadav <rohit.yadav@xxxxxxxxxxxxx> 
Sent: 19 November 2018 00:51
To: dev@xxxxxxxxxxxxxxxxxxxxx
Subject: Re: CloudStack master and 4.11.2 RC5 build issues

Hi Wido,

Can you share the output using jdk8 by running the mvn command with -e and -X (you'll need to add that in some file in the debian directory or sinply do a mvn based build with those flags)? Alternatively, you may also skip tests using - DskipTests to get around the issue. Looks like it started happening recently in 18.04 (I'm able to reproduce as well).

Rohit Yadav

From: Wido den Hollander <wido@xxxxxxxxx>
Sent: Monday, November 19, 2018 12:26:47 AM
To: dev@xxxxxxxxxxxxxxxxxxxxx
Subject: CloudStack master and 4.11.2 RC5 build issues


Trying to build master using this command it fails:

$ dpkg-buildpackage -us -uc -b

I get this error:

[INFO] Total time: 7.282 s
[INFO] Finished at: 2018-11-18T19:55:10+01:00 [INFO] Final Memory: 50M/174M [INFO]
[ERROR] Failed to execute goal
(default-test) on project cloud-framework-managed-context: Execution default-test of goal org.apache.maven.plugins:maven-surefire-plugin:2.18.1:test failed: The forked VM terminated without properly saying goodbye. VM crash or System.exit called?
[ERROR] Command was /bin/sh -c cd
&& /usr/lib/jvm/java-11-openjdk-amd64/bin/java -noverify -jar /home/wido/Desktop/apache-cloudstack-
[ERROR] -> [Help 1]

I tried both Java 8 and 11 JDK from Ubuntu 18.04, but in both cases it fails.

wido@wido-laptop:~$ java -version
openjdk version "10.0.2" 2018-07-17
OpenJDK Runtime Environment (build 10.0.2+13-Ubuntu-1ubuntu0.18.04.3)
OpenJDK 64-Bit Server VM (build 10.0.2+13-Ubuntu-1ubuntu0.18.04.3, mixed

Have other people seen this?


Amadeus House, Floral Street, London  WC2E 9DPUK @shapeblue